{"text_format":"1","workbook":"xlsx","n_sheets":11,"sheets":["CMT Calculation","IRS Calculation","G-Sec Yield Curve","MIFOR curve","Overnight curve","Help","Clients input","Output Sheet","Dialog1","Range","Temp"],"not_rendered":{"charts":0,"images":15,"macros":1,"external_links":0,"defined_names":41,"comments":1,"pivot_tables":0},"unopened":[{"sheet":"Dialog1","index":8,"reason":"not_a_worksheet"}],"bounds":{"document_bytes":16777216,"sheet_cells":100000,"rows_first":2000,"rows_last":500,"rows_between":2000,"halvings":0,"cell_chars":16384,"cell_head_chars":4096},"cells_cut":0,"cells_raw":0,"read":"whole","date_system":"1900"}

{"sheet":"CMT Calculation","index":0,"n_rows":129,"n_cols":34,"rows_kept":129,"cut":false,"hidden":true,"merged":[[7,27,7,29]]}
["Fixed Rate",7.9644003107536665E-2,{"$f":"CMTFixed*freq","v":{"$error":"#N/A"}},"Volatility of n-period fwd rate",null,0.12,null,null,null,null,null,null,null,null,null,null,"PV Swap",{"$f":"SUM(W10:W129)+SUM(AH10:AH129)","v":0}]
[null,null,null,"Volatility of  index",null,0.1]
["Calculations",null,null,"Correlation of fwd rate and index",null,0.7]
["Current index",null,{"$f":"VLOOKUP(index,$A$10:$C$129,3,FALSE)","v":{"$error":"#N/A"}}]
[]
["Calculation of forward par rates",null,null,null,null,null,null,null,null,"Calculation of  G' & G''"]
[null,"year Swap Rate after",null,1,"Years=",{"$f":"freq*(VLOOKUP($D$7*12,$A$10:$D$129,4)-VLOOKUP($D$7*12+index,$A$10:$D$129,4))/(SUM($G$10:$G$129))","v":{"$error":"#N/A"}},null,null,null,"G''/G' (y0)=",{"$f":"SUM(O10:O51)/SUM(N10:N51)","v":{"$error":"#N/A"}}]
[null,null,null,null,null,null,null,null,null,null,null,null,null,null,null,null,null,null,null,null,null,null,null,null,null,null,null,null,null,null,"Broken Period Calculation"]
["Maturity","Par Rate","Par ( at appropriate freq)","df","Spot","Include","Included df",null,null,"Maturity","G'","G''","Include","G'","G''",null,"Maturity","Forward Par Rates","Par Rates","Adjusted Forward Swap Rates","Expected Cash Flow","Discount Factors","Discounted Expected Cash Flow",null,"temp1","temp2",null,null,null,null,"Flag","Broken Period","Broken Period cash flow","PV of brokenperiod cash flow"]
[{"$f":"Range!C48","v":{"$error":"#N/A"}},{"$f":"IF(ISERROR(VLOOKUP(A10,'G-Sec Yield Curve'!$A$4:$E$123,5,FALSE)),\"\",VLOOKUP(A10,'G-Sec Yield Curve'!$A$4:$E$123,5,FALSE))","v":""},{"$f":"IF(ISERROR(NOMINAL(B10,freq)),\"\",NOMINAL(B10,freq))","v":""},{"$f":"IF(ISERROR(VLOOKUP(A10,'G-Sec Yield Curve'!$A$4:$D$123,4,FALSE)),\"\",VLOOKUP(A10,'G-Sec Yield Curve'!$A$4:$D$123,4,FALSE))","v":""},null,{"$f":"IF(AND(A10/12>$D$7,A10/12<=$D$7+index/12),1,0)","v":{"$error":"#N/A"}},{"$f":"IF(ISERROR(D10*F10),\"\",D10*F10)","v":""},null,null,{"$f":"A10","v":{"$error":"#N/A"}},{"$f":"IF(J10=\"\",\"\",IF(J10<>term,-(J10/12)*$C$4/((1+$C$4/freq)^(freq*(J10/12)+1)),-(J10/12)*(1+$C$4)/((1+$C$4/freq)^(freq*(J10/12)+1))))","v":{"$error":"#N/A"}},{"$f":"IF(J10=\"\",\"\",IF(J10<>term,(J10/12)*$C$4*((J10/12)+1/freq)/(1+$C$4/freq)^(freq*(J10/12)+2),(J10/12)*(1+$C$4)*((J10/12)+1/freq)/(1+$C$4/freq)^(freq*(J10/12)+2)))","v":{"$error":"#N/A"}},{"$f":"IF(J10<=index,1,0)","v":{"$error":"#N/A"}},{"$f":"K10*M10","v":{"$error":"#N/A"}},{"$f":"L10*M10","v":{"$error":"#N/A"}},null,{"$f":"A10","v":{"$error":"#N/A"}},7.6345155854359081E-2,{"$f":"IF(ISERROR(B10),\"\",B10)","v":""},{"$f":"IF(R10=\"\",0,(R10-0.5*R10^2*sigy^2*(Q10/12)*$K$7-R10*S10*cor*sigy*sigr*(Q10/12)/(freq+S10)))","v":{"$error":"#N/A"}},{"$f":"IF(T10=0,0,(T10/freq)-CMTFixed)","v":{"$error":"#N/A"}},{"$f":"D10","v":""},{"$f":"IF(ISERROR(U10*V10),\"\",U10*V10)","v":""},null,{"$f":"IF(W10=\"\",0,(W10-0.5*W10^2*sigy^2*(V10/12)*$K$7-W10*X10*cor*sigy*sigr*(V10/12)/(freq+X10)))","v":0},{"$f":"X10","v":0},null,null,null,null,0,{"$f":"IF(AE10=1,term-Q10,0)","v":0},{"$f":"T10*AF10/12-(CMTFixed*freq)*AF10/12","v":{"$error":"#N/A"}},{"$f":"IF(ISERROR(AG10*D10),\"\",AG10*D10)","v":""}]
{"$rows_left_out":120}
{"sheet":"IRS Calculation","index":1,"n_rows":122,"n_cols":14,"rows_kept":122,"cut":false,"hidden":true,"merged":[[1,13,1,15]]}
["Fixed Rate",7.3911597095447951E-2,null,null,null,null,null,"PV Swap",{"$f":"SUM(I4:I122)+SUM(N4:N122)","v":0}]
[null,null,null,null,null,null,null,null,null,null,"Calculation for PV of Broken Period"]
["Maturity (months)","Par Rate","Par ( at appropriate freq)","df","Spot","Fwd","Include","CF","PV of CF",null,"Flag","Months in Broken Period","Broken Period cash flow","PV of Broken Period Cash flow"]
[{"$f":"Range!C48","v":{"$error":"#N/A"}},{"$f":"IF(ISERROR(VLOOKUP(A4,$N$4:$P$21,2)),$O$4+$P$4*(A4-$N$4),VLOOKUP(A4,$N$4:$P$21,2)+VLOOKUP(A4,$N$4:$P$21,3)*(A4-VLOOKUP(A4,$N$4:$P$21,1)))","v":{"$error":"#N/A"}},{"$f":"EFFECT(B4,freq)","v":{"$error":"#N/A"}},{"$f":"IF(ISERROR(IF(Range!$C$23=1,VLOOKUP('IRS Calculation'!A4,'G-Sec Yield Curve'!$A$4:$D$123,4,FALSE),IF(Range!$C$23=2,VLOOKUP(A4,'Overnight curve'!$H$3:$J$62,3,FALSE),IF(Range!$C$23=3, VLOOKUP(A4,'MIFOR curve'!$H$3:$J$62,3,FALSE),\"\")))),\"\",IF(Range!$C$23=1,VLOOKUP('IRS Calculation'!A4,'G-Sec Yield Curve'!$A$4:$D$123,4,FALSE),IF(Range!$C$23=2,VLOOKUP(A4,'Overnight curve'!$H$3:$J$62,3,FALSE),IF(Range!$C$23=3, VLOOKUP(A4,'MIFOR curve'!$H$3:$J$62,3,FALSE),\"\"))))","v":""},{"$f":"IF(ISERROR((1/D4)^(12/A4)-1),\"\",(1/D4)^(12/A4)-1)","v":""},{"$f":"E4","v":""},{"$f":"IF(A4<='Clients input'!$B$8,1,0)","v":{"$error":"#N/A"}},{"$f":"IF(G4=0,0,((1+F4)^(1/freq)-1-IRSFixed/freq))","v":{"$error":"#N/A"}},{"$f":"IF(ISERROR(H4*D4),\"\",H4*D4)","v":""},null,{"$f":"IF(G4=G5,0,1)","v":{"$error":"#N/A"}},{"$f":"IF(K4=0,0,term-'IRS Calculation'!A4)","v":{"$error":"#N/A"}},{"$f":"IF(ISERROR((L4/Range!$C$48)*(F4-IRSFixed)),\"\",(L4/Range!$C$48)*(F4-IRSFixed))","v":""},{"$f":"IF(ISERROR(M4*D4),0,M4*D4)","v":0}]
[{"$f":"A4+Range!$C$48","v":{"$error":"#N/A"}},{"$error":"#N/A"},{"$error":"#N/A"},{"$f":"IF(ISERROR(IF(Range!$C$23=1,VLOOKUP('IRS Calculation'!A5,'G-Sec Yield Curve'!$A$4:$D$123,4,FALSE),IF(Range!$C$23=2,VLOOKUP(A5,'Overnight curve'!$H$3:$J$62,3,FALSE),IF(Range!$C$23=3, VLOOKUP(A5,'MIFOR curve'!$H$3:$J$62,3,FALSE),\"\")))),\"\",IF(Range!$C$23=1,VLOOKUP('IRS Calculation'!A5,'G-Sec Yield Curve'!$A$4:$D$123,4,FALSE),IF(Range!$C$23=2,VLOOKUP(A5,'Overnight curve'!$H$3:$J$62,3,FALSE),IF(Range!$C$23=3, VLOOKUP(A5,'MIFOR curve'!$H$3:$J$62,3,FALSE),\"\"))))","v":""},{"$f":"IF(ISERROR((1/D5)^(12/A5)-1),\"\",(1/D5)^(12/A5)-1)","v":""},{"$f":"IF(ISERROR(((D4/D5)^(12/Range!$C$48)-1)),\"\",(D4/D5)^(12/Range!$C$48)-1)","v":""},{"$f":"IF(A5<='Clients input'!$B$8,1,0)","v":{"$error":"#N/A"}},{"$f":"IF(G5=0,0,((1+F5)^(1/freq)-1-IRSFixed/freq))","v":{"$error":"#N/A"}},{"$f":"IF(ISERROR(H5*D5),\"\",H5*D5)","v":""},null,{"$f":"IF(G5=G6,0,1)","v":{"$error":"#N/A"}},{"$f":"IF(K5=0,0,term-'IRS Calculation'!A5)","v":{"$error":"#N/A"}},{"$f":"IF(ISERROR((L5/Range!$C$48)*(F5-IRSFixed)),\"\",(L5/Range!$C$48)*(F5-IRSFixed))","v":""},{"$f":"IF(ISERROR(M5*D5),0,M5*D5)","v":0}]
[{"$f":"A5+Range!$C$48","v":{"$error":"#N/A"}},{"$error":"#N/A"},{"$error":"#N/A"},{"$f":"IF(ISERROR(IF(Range!$C$23=1,VLOOKUP('IRS Calculation'!A6,'G-Sec Yield Curve'!$A$4:$D$123,4,FALSE),IF(Range!$C$23=2,VLOOKUP(A6,'Overnight curve'!$H$3:$J$62,3,FALSE),IF(Range!$C$23=3, VLOOKUP(A6,'MIFOR curve'!$H$3:$J$62,3,FALSE),\"\")))),\"\",IF(Range!$C$23=1,VLOOKUP('IRS Calculation'!A6,'G-Sec Yield Curve'!$A$4:$D$123,4,FALSE),IF(Range!$C$23=2,VLOOKUP(A6,'Overnight curve'!$H$3:$J$62,3,FALSE),IF(Range!$C$23=3, VLOOKUP(A6,'MIFOR curve'!$H$3:$J$62,3,FALSE),\"\"))))","v":""},"",{"$f":"IF(ISERROR(((D5/D6)^(12/Range!$C$48)-1)),\"\",(D5/D6)^(12/Range!$C$48)-1)","v":""},{"$f":"IF(A6<='Clients input'!$B$8,1,0)","v":{"$error":"#N/A"}},{"$error":"#N/A"},"",null,{"$error":"#N/A"},{"$f":"IF(K6=0,0,term-'IRS Calculation'!A6)","v":{"$error":"#N/A"}},{"$f":"IF(ISERROR((L6/Range!$C$48)*(F6-IRSFixed)),\"\",(L6/Range!$C$48)*(F6-IRSFixed))","v":""},0]
[{"$f":"A6+Range!$C$48","v":{"$error":"#N/A"}},{"$error":"#N/A"},{"$error":"#N/A"},{"$f":"IF(ISERROR(IF(Range!$C$23=1,VLOOKUP('IRS Calculation'!A7,'G-Sec Yield Curve'!$A$4:$D$123,4,FALSE),IF(Range!$C$23=2,VLOOKUP(A7,'Overnight curve'!$H$3:$J$62,3,FALSE),IF(Range!$C$23=3, VLOOKUP(A7,'MIFOR curve'!$H$3:$J$62,3,FALSE),\"\")))),\"\",IF(Range!$C$23=1,VLOOKUP('IRS Calculation'!A7,'G-Sec Yield Curve'!$A$4:$D$123,4,FALSE),IF(Range!$C$23=2,VLOOKUP(A7,'Overnight curve'!$H$3:$J$62,3,FALSE),IF(Range!$C$23=3, VLOOKUP(A7,'MIFOR curve'!$H$3:$J$62,3,FALSE),\"\"))))","v":""},"",{"$f":"IF(ISERROR(((D6/D7)^(12/Range!$C$48)-1)),\"\",(D6/D7)^(12/Range!$C$48)-1)","v":""},{"$f":"IF(A7<='Clients input'!$B$8,1,0)","v":{"$error":"#N/A"}},{"$error":"#N/A"},"",null,{"$error":"#N/A"},{"$f":"IF(K7=0,0,term-'IRS Calculation'!A7)","v":{"$error":"#N/A"}},{"$f":"IF(ISERROR((L7/Range!$C$48)*(F7-IRSFixed)),\"\",(L7/Range!$C$48)*(F7-IRSFixed))","v":""},0]
[{"$f":"A7+Range!$C$48","v":{"$error":"#N/A"}},{"$error":"#N/A"},{"$error":"#N/A"},{"$f":"IF(ISERROR(IF(Range!$C$23=1,VLOOKUP('IRS Calculation'!A8,'G-Sec Yield Curve'!$A$4:$D$123,4,FALSE),IF(Range!$C$23=2,VLOOKUP(A8,'Overnight curve'!$H$3:$J$62,3,FALSE),IF(Range!$C$23=3, VLOOKUP(A8,'MIFOR curve'!$H$3:$J$62,3,FALSE),\"\")))),\"\",IF(Range!$C$23=1,VLOOKUP('IRS Calculation'!A8,'G-Sec Yield Curve'!$A$4:$D$123,4,FALSE),IF(Range!$C$23=2,VLOOKUP(A8,'Overnight curve'!$H$3:$J$62,3,FALSE),IF(Range!$C$23=3, VLOOKUP(A8,'MIFOR curve'!$H$3:$J$62,3,FALSE),\"\"))))","v":""},"",{"$f":"IF(ISERROR(((D7/D8)^(12/Range!$C$48)-1)),\"\",(D7/D8)^(12/Range!$C$48)-1)","v":""},{"$f":"IF(A8<='Clients input'!$B$8,1,0)","v":{"$error":"#N/A"}},{"$error":"#N/A"},"",null,{"$error":"#N/A"},{"$f":"IF(K8=0,0,term-'IRS Calculation'!A8)","v":{"$error":"#N/A"}},{"$f":"IF(ISERROR((L8/Range!$C$48)*(F8-IRSFixed)),\"\",(L8/Range!$C$48)*(F8-IRSFixed))","v":""},0]
[{"$f":"A8+Range!$C$48","v":{"$error":"#N/A"}},{"$error":"#N/A"},{"$error":"#N/A"},{"$f":"IF(ISERROR(IF(Range!$C$23=1,VLOOKUP('IRS Calculation'!A9,'G-Sec Yield Curve'!$A$4:$D$123,4,FALSE),IF(Range!$C$23=2,VLOOKUP(A9,'Overnight curve'!$H$3:$J$62,3,FALSE),IF(Range!$C$23=3, VLOOKUP(A9,'MIFOR curve'!$H$3:$J$62,3,FALSE),\"\")))),\"\",IF(Range!$C$23=1,VLOOKUP('IRS Calculation'!A9,'G-Sec Yield Curve'!$A$4:$D$123,4,FALSE),IF(Range!$C$23=2,VLOOKUP(A9,'Overnight curve'!$H$3:$J$62,3,FALSE),IF(Range!$C$23=3, VLOOKUP(A9,'MIFOR curve'!$H$3:$J$62,3,FALSE),\"\"))))","v":""},"",{"$f":"IF(ISERROR(((D8/D9)^(12/Range!$C$48)-1)),\"\",(D8/D9)^(12/Range!$C$48)-1)","v":""},{"$f":"IF(A9<='Clients input'!$B$8,1,0)","v":{"$error":"#N/A"}},{"$error":"#N/A"},"",null,{"$error":"#N/A"},{"$f":"IF(K9=0,0,term-'IRS Calculation'!A9)","v":{"$error":"#N/A"}},{"$f":"IF(ISERROR((L9/Range!$C$48)*(F9-IRSFixed)),\"\",(L9/Range!$C$48)*(F9-IRSFixed))","v":""},0]
[{"$f":"A9+Range!$C$48","v":{"$error":"#N/A"}},{"$error":"#N/A"},{"$error":"#N/A"},{"$f":"IF(ISERROR(IF(Range!$C$23=1,VLOOKUP('IRS Calculation'!A10,'G-Sec Yield Curve'!$A$4:$D$123,4,FALSE),IF(Range!$C$23=2,VLOOKUP(A10,'Overnight curve'!$H$3:$J$62,3,FALSE),IF(Range!$C$23=3, VLOOKUP(A10,'MIFOR curve'!$H$3:$J$62,3,FALSE),\"\")))),\"\",IF(Range!$C$23=1,VLOOKUP('IRS Calculation'!A10,'G-Sec Yield Curve'!$A$4:$D$123,4,FALSE),IF(Range!$C$23=2,VLOOKUP(A10,'Overnight curve'!$H$3:$J$62,3,FALSE),IF(Range!$C$23=3, VLOOKUP(A10,'MIFOR curve'!$H$3:$J$62,3,FALSE),\"\"))))","v":""},"",{"$f":"IF(ISERROR(((D9/D10)^(12/Range!$C$48)-1)),\"\",(D9/D10)^(12/Range!$C$48)-1)","v":""},{"$f":"IF(A10<='Clients input'!$B$8,1,0)","v":{"$error":"#N/A"}},{"$error":"#N/A"},"",null,{"$error":"#N/A"},{"$f":"IF(K10=0,0,term-'IRS Calculation'!A10)","v":{"$error":"#N/A"}},{"$f":"IF(ISERROR((L10/Range!$C$48)*(F10-IRSFixed)),\"\",(L10/Range!$C$48)*(F10-IRSFixed))","v":""},0]
{"$rows_left_out":113}
{"sheet":"G-Sec Yield Curve","index":2,"n_rows":123,"n_cols":17,"rows_kept":123,"cut":false,"hidden":true,"merged":[]}
[null,null,null,null,null,null,null,null,null,null,null,null,null,"Computation of annualized spots"]
[null,"G-Sec Yield Curve",null,null,null,null,null,null,null,null,"Input"]
["Tenor(months)","Annualised Spots",null,"Discount Factor","Annualized par rates",null,null,null,null,null,"Tenor","Yield",null,"Tenor (yrs)","Semi annual Par Yield","Discount factors","Annualised spot"]
[1,null,{"$f":"C6","v":7.5286762611370683E-2},{"$f":"1/(1+C4)^(A4/12)","v":0.99396930956269691},{"$f":"C4","v":7.5286762611370683E-2},null,null,null,null,null,"3 month",7.3249999999999996E-2,null,0.5,{"$f":"L5","v":7.3249999999999996E-2},{"$f":"1/(1+O4/2)^(N4*2)","v":0.96466899795007843},{"$f":"(1/P4)^(1/N4)-1","v":7.4591390624999754E-2}]
[2,null,{"$f":"C6","v":7.5286762611370683E-2},{"$f":"1/(1+C5)^(A5/12)","v":0.98797498835254416},{"$f":"C5","v":7.5286762611370683E-2},null,null,null,null,null,"6 month",7.3249999999999996E-2,null,1,{"$f":"L6","v":7.4910000000000004E-2},{"$f":"(1-O5/2*SUM($P$4:P4))/(1+O5/2)","v":0.92907000562123643},{"$f":"(1/P5)^(1/N5)-1","v":7.6345155854359081E-2}]
[3,null,{"$f":"EFFECT(L4,4)","v":7.5286762611370683E-2},0.98201681703799182,7.5286762611370683E-2,null,null,null,null,null,"12 month",7.4910000000000004E-2,null,1.5,{"$f":"AVERAGE(O7,O5)","v":7.6490000000000002E-2},{"$f":"(1-O6/2*SUM($P$4:P5))/(1+O6/2)","v":0.8934056526238171},7.8038330237813591E-2]
[4,null,{"$f":"$C$6+($C$9-$C$6)*(A7-$A$6)/($A$9-$A$6)","v":7.505497194924704E-2},0.97616472389911813,7.505497194924704E-2,null,null,null,null,null,"2 year",7.8070000000000001E-2,null,2,{"$f":"L7","v":7.8070000000000001E-2},{"$f":"(1-O7/2*SUM($P$4:P6))/(1+O7/2)","v":0.85772260640442632},7.9758351147746875E-2]
[5,null,{"$f":"$C$6+($C$9-$C$6)*(A8-$A$6)/($A$9-$A$6)","v":7.4823181287123397E-2},0.97038238971186208,7.4823181287123397E-2,null,null,null,null,null,"3 year",7.8814999999999996E-2,null,2.5,{"$f":"AVERAGE(O9,O7)","v":7.8442499999999998E-2},{"$f":"(1-O8/2*SUM($P$4:P7))/(1+O8/2)","v":0.82469806104981702},8.0144878066599423E-2]
[6,null,{"$f":"IF(ISERROR(VLOOKUP(A9/12,$N$4:$Q$23,4,FALSE)),\"\",VLOOKUP(A9/12,$N$4:$Q$23,4,FALSE))","v":7.4591390624999754E-2},0.96466899795007843,7.4591390624999754E-2,null,null,null,null,null,"4 year",8.0149999999999999E-2,null,3,{"$f":"L8","v":7.8814999999999996E-2},{"$f":"(1-O9/2*SUM($P$4:P8))/(1+O9/2)","v":0.79263003635079332},8.0545746483400071E-2]
[7,null,{"$f":"$C$9+($C$15-$C$9)*(A10-$A$9)/($A$15-$A$9)","v":7.488368482989298E-2},0.95875095288905621,7.488368482989298E-2,null,null,null,null,null,"5 year",8.1705E-2,null,3.5,{"$f":"AVERAGE(O11,O9)","v":7.9482499999999998E-2},{"$f":"(1-O10/2*SUM($P$4:P9))/(1+O10/2)","v":0.76064480335794427},8.1304543492344949E-2]
{"$rows_left_out":114}
{"sheet":"MIFOR curve","index":3,"n_rows":62,"n_cols":13,"rows_kept":62,"cut":false,"hidden":true,"merged":[]}
[null,null,"Rate",null,null,null,null,"Linear interpolation",null,null,null,"Mod date",{"$f":"TODAY()","v":"2012-09-23"}]
[null,"MITOR",7.0000000000000007E-2,null,null,null,null,"Months","Nominal Rate","Discount factor"]
[null,"1M MIFOR",7.0999999999999994E-2,null,null,null,null,1,{"$f":"C3","v":7.0999999999999994E-2},{"$f":"1/(1+I3*H3/12)","v":0.99411813437163454},null,"MIFOR rate for tenor"]
[null,"2M MIFOR",7.1999999999999995E-2,null,null,null,null,2,{"$f":"AVERAGE(I3,I5)","v":7.1999999999999995E-2},0.98814229249011853,null,{"$f":"VLOOKUP(term,'MIFOR curve'!H3:I62,2,FALSE)","v":0}]
[null,"3M MIFOR",7.2999999999999995E-2,null,null,null,null,3,{"$f":"C5","v":7.2999999999999995E-2},0.98207709305180446]
[null,"6M MIFOR",7.3999999999999996E-2,null,null,null,null,4,{"$f":"$I$5+($I$8-$I$5)*(H6-$H$5)/($H$8-$H$5)","v":7.3333333333333334E-2},0.97613882863340562]
[null,"9M MIFOR",7.49999999999999E-2,null,null,null,null,5,{"$f":"$I$5+($I$8-$I$5)*(H7-$H$5)/($H$8-$H$5)","v":7.3666666666666658E-2},0.97021964694785079]
[null,"12M MIFOR",7.5999999999999901E-2,null,null,null,null,6,{"$f":"C6","v":7.3999999999999996E-2},0.96432015429122475]
[null,null,null,null,null,null,null,7,{"$f":"$I$8+($I$11-$I$8)*(H9-$H$8)/($H$11-$H$8)","v":7.4333333333333293E-2},0.95844093607731418]
[null,null,null,null,null,null,null,8,{"$f":"$I$8+($I$11-$I$8)*(H10-$H$8)/($H$11-$H$8)","v":7.4666666666666603E-2},0.95258255715495355]
{"$rows_left_out":53}
{"sheet":"Overnight curve","index":4,"n_rows":62,"n_cols":13,"rows_kept":62,"cut":false,"hidden":false,"merged":[]}
[null,null,"Rate",null,null,null,null,"Linear interpolation",null,null,null,"Mod date",{"$f":"TODAY()","v":"2012-09-23"}]
[null,"MIBOR",7.0000000000000007E-2,null,null,null,null,"Months","Nominal Rate","Discount factor"]
[null,"1M MIOIS",7.0999999999999994E-2,null,null,null,null,1,{"$f":"C3","v":7.0999999999999994E-2},{"$f":"1/(1+I3*H3/12)","v":0.99411813437163454},null,"OIS rate for tenor"]
[null,"2M MIOIS",7.1999999999999995E-2,null,null,null,null,2,{"$f":"C4","v":7.1999999999999995E-2},{"$f":"1/(1+I4*H4/12)","v":0.98814229249011853},null,{"$f":"VLOOKUP(term,'Overnight curve'!H3:I62,2,FALSE)","v":7.6999999999999902E-2}]
[null,"3M MIOIS",7.2999999999999995E-2,null,null,null,null,3,{"$f":"C5","v":7.2999999999999995E-2},0.98207709305180446]
[null,"6M MIOIS",7.3999999999999996E-2,null,null,null,null,4,{"$f":"$I$5+($I$8-$I$5)*(H6-$H$5)/($H$8-$H$5)","v":7.3333333333333334E-2},0.97613882863340562]
[null,"9M MIOIS",7.49999999999999E-2,null,null,null,null,5,{"$f":"$I$5+($I$8-$I$5)*(H7-$H$5)/($H$8-$H$5)","v":7.3666666666666658E-2},0.97021964694785079]
[null,"12M MIOIS",7.5999999999999901E-2,null,null,null,null,6,{"$f":"C6","v":7.3999999999999996E-2},0.96432015429122475]
[null,"2Y MIOIS",7.6999999999999902E-2,null,null,null,null,7,{"$f":"$I$8+($I$11-$I$8)*(H9-$H$8)/($H$11-$H$8)","v":7.4333333333333293E-2},0.95844093607731418]
[null,"3Y MIOIS",7.7999999999999903E-2,null,null,null,null,8,{"$f":"$I$8+($I$11-$I$8)*(H10-$H$8)/($H$11-$H$8)","v":7.4666666666666603E-2},0.95258255715495355]
{"$rows_left_out":53}
{"sheet":"Help","index":5,"n_rows":35,"n_cols":2,"rows_kept":35,"cut":false,"hidden":false,"merged":[]}
[null,"Help sheet for the Swap Calculator"]
[null,"This calculator is meant to be used as a tool for assessing swap rates. Users will have to enter the yield curve and the Bid/Ask spread they want"]
[null,"Fixed-floating interest rate swaps"]
[1,"Enter the term of the swap."]
[2,"Choose the floating rate benchmark"]
[null,"Curently available benchmarks are Government Treasury, OIS rates and MIFOR"]
[3,"Choose the floating rate reset frequency."]
[null,"For a G-Sec, this means that the floating rate will be the yield on a G-Sec with the same maturity as the reset frequency"]
[null,"For OIS and MIFOR, this means that the floating rate will be OIS or the MIFOR for the same tenor as the reset frequency"]
[4,"Choose frequency of cash flow exchange"]
{"$rows_left_out":26}
{"sheet":"Clients input","index":6,"n_rows":22,"n_cols":6,"rows_kept":22,"cut":false,"hidden":false,"merged":[]}
[]
[null,null,"Swap Calculator"]
[]
["Value Date",{"$f":"TODAY()","v":"2012-09-23"},null,"Yield Curve Modification Date",null,{"$f":"Range!G1","v":"2001-12-24"}]
[]
["Swap Type"]
[]
["Term of the Swap",24,"months","Please see help sheet for maximum term possible"]
[]
["Client receives"]
{"$rows_left_out":13}
{"sheet":"Output Sheet","index":7,"n_rows":20,"n_cols":5,"rows_kept":20,"cut":false,"hidden":true,"merged":[]}
[]
[]
[]
["Swap Calculator Output","Yield curve modification date",null,null,{"$f":"'Clients input'!F4","v":"2001-12-24"}]
[]
["Value Date",{"$f":"'Clients input'!B4","v":"2012-09-23"}]
[]
["Type of Swap",{"$f":"chosenswaptype","v":"Overnight Interest Swap"}]
[]
["Term of the Swap",{"$f":"term","v":24},"months"]
{"$rows_left_out":11}
{"sheet":"Range","index":9,"n_rows":80,"n_cols":8,"rows_kept":80,"cut":false,"hidden":true,"merged":[]}
[null,"Swap Type",null,null,null,"modifcation date",37249]
[null,"Fixed-Floating IRS Swap",1]
[null,"Constant Maturity Treasury Swap",2]
[null,"Overnight Interest Swap",3]
[null,"Chosen"]
[null,"Overnight Interest Swap",{"$f":"VLOOKUP(chosenswaptype,B2:C4,2,FALSE)","v":3}]
[]
[]
[null,"Receive"]
[null,"Fixed",1]
{"$rows_left_out":71}
{"sheet":"Temp","index":10,"n_rows":27,"n_cols":9,"rows_kept":27,"cut":false,"hidden":true,"merged":[]}
["Fixed-Floating IRS",1,null,null,"91-day T-bill (Primary Cutoff)",1,null,"Reuters Benchmark",1]
["Fixed-Floating CMT Swap",2,null,null,"91-day T-Bill (Secondary Market)",2,null,"Bloomberg/FIMMDA Fair Market Curve",2]
[null,null,null,null,"182-day T-bill (Primary Cutoff)",3,null,"User Supplied",3]
[null,null,null,null,"182-day T-Bill (Secondary Market)",4]
[null,null,null,null,"364-day T-Bill (Primary cut-off)",5]
[null,null,null,null,"MIBOR (Overnight) ",6]
["Actual/actual",1,null,null,"MIBOR (3 Month)",7]
["Actual/360",2,null,null,"1Yr. Benchmark GOISEC",8]
["Actual/365",3,null,null,"3 month OIS",9]
["European 30/360",4,null,null,"6 Month OIS",10]
{"$rows_left_out":17}